[Libwebsockets] build error on 'cmake .. -DCMAKE_INSTALL_PREFIX:PATH=/usr'

Andy Green andy at warmcat.com
Tue May 6 08:54:10 CEST 2014



On 6 May 2014 13:26:53 GMT+08:00, Michael Haberler <mail17 at mah.priv.at> wrote:
>(is this the right incantation ?)
>
>commit 7cc7ae476a6
>ubuntu 10.04 LTS
>
>cmake .. -DCMAKE_INSTALL_PREFIX:PATH=/usr

Yes... your error is before the install phase so whatever it is, it isn't this.

Try redoing in a fresh build dir.

-Andy

>...
>[ 52%] Built target test-ping
>[ 54%] Building C object
>CMakeFiles/test-server.dir/test-server/test-server.c.o
>Linking C executable bin/libwebsockets-test-server
>/bin/sh: cannot create /../share/libwebsockets-test-server: Directory
>nonexistent
>make[2]: *** [bin/libwebsockets-test-server] Error 2
>make[1]: *** [CMakeFiles/test-server.dir/all] Error 2
>make: *** [all] Error 2
>
>thanks,
>
>- Micahel
>
>_______________________________________________
>Libwebsockets mailing list
>Libwebsockets at ml.libwebsockets.org
>http://ml.libwebsockets.org/mailman/listinfo/libwebsockets




More information about the Libwebsockets mailing list